{"text_format":"1","workbook":"xlsx","n_sheets":18,"sheets":["Cover and info","Summary","ProfitAndLoss","BalanceSheet","CashFlow","Capex","CapexBreakdown","Operating Costs","Operating Costs Allocation","Revenue","Contributions","Provisions","ThirdParty","RelatedParty","UnbundledSegments","Non-prescribed","RollForward","Lookups"],"not_rendered":{"charts":0,"images":0,"macros":1,"external_links":2,"defined_names":37,"comments":6,"pivot_tables":0},"unopened":[],"bounds":{"document_bytes":16777216,"sheet_cells":100000,"rows_first":2000,"rows_last":500,"rows_between":2000,"halvings":0,"cell_chars":16384,"cell_head_chars":4096},"cells_cut":0,"cells_raw":0,"read":"whole","date_system":"1900"}

{"sheet":"Cover and info","index":0,"n_rows":65526,"n_cols":4,"rows_kept":65526,"cut":false,"hidden":false,"merged":[]}
["Water Regulatory Accounting Template"]
["South East Water"]
["Submission for:",null,9]
[]
[]
[]
[null,"Table of contents"]
[null,null,{"$f":"ProfitAndLoss!A3","v":"1. Profit and loss"}]
[null,null,{"$f":"BalanceSheet!A3","v":"2. Balance sheet"}]
[null,null,{"$f":"CashFlow!A3","v":"3. Cash flow statement"}]
[null,null,{"$f":"Capex!A3","v":"4. Capital expenditure"}]
[null,null,{"$f":"CapexBreakdown!A3","v":"5. Capital expenditure breakdown"}]
[null,null,{"$f":"'Operating Costs'!A3","v":"6. Operating costs"}]
[null,null,{"$f":"+'Operating Costs Allocation'!A3","v":"7. Operating costs allocation"}]
[null,null,{"$f":"Revenue!A3","v":"8. Revenue"}]
[null,null,{"$f":"+Contributions!A3","v":"9. Contributions"}]
[null,null,{"$f":"Provisions!A3","v":"10. Provisions - OPTIONAL WORKSHEET, BUSINESS MAY COMPLETE AT THEIR DISCRETION"}]
[null,null,{"$f":"ThirdParty!A3","v":"11. Third party transactions (remains confidential) - OPTIONAL WORKSHEET, BUSINESS MAY COMPLETE AT THEIR DISCRETION"}]
[null,null,{"$f":"RelatedParty!A3","v":"12. Related party transactions (remains confidential) - OPTIONAL WORKSHEET, BUSINESS MAY COMPLETE AT THEIR DISCRETION"}]
[null,null,{"$f":"UnbundledSegments!A3","v":"13. Unbundled segments - OPTIONAL WORKSHEET, BUSINESS MAY COMPLETE AT THEIR DISCRETION"}]
{"$rows_left_out":65507}
{"sheet":"Summary","index":1,"n_rows":27,"n_cols":10,"rows_kept":27,"cut":false,"hidden":false,"merged":[]}
[]
[]
[null,null,null,null,null,null,null,"Summary details",null,{"$f":"INDEX(LU_Years,Summary!SC_Date)","v":"2022-23"}]
[]
[null,null,null,null,null,null,null,"Prescribed Regulatory Expenditure"]
[null,null,null,null,null,null,null,"Total Prescribed Operating Expenditure",null,{"$f":"'Operating Costs'!F24","v":0}]
[null,null,null,null,null,null,null,"Total Prescribed Capital Expenditure",null,{"$f":"Capex!C14","v":0}]
[null,null,null,null,null,null,null,"Total Prescribed Expenditure",null,{"$f":"SUM(J6:J7)","v":0}]
[]
[null,null,null,null,null,null,null,"Non prescribed expenditure"]
[null,null,null,null,null,null,null,"Total Non prescribed Operating Expenditure",null,{"$f":"'Operating Costs'!F26","v":0}]
[null,null,null,null,null,null,null,"Total Non prescribed Capital Expenditure",null,{"$f":"'Non-prescribed'!F52","v":0}]
[null,null,null,null,null,null,null,"Total Non prescribed Expenditure",null,{"$f":"SUM(J11:J12)","v":0}]
[]
[null,null,null,null,null,null,null,"Contributions"]
[null,null,null,null,null,null,null,"Government contributions",null,{"$f":"SUMIFS(Contributions!$G$11:$G$40,Contributions!$F$11:$F$40,\"Will offset prices\",Contributions!$E$11:$E$40,\"Capital\",Contributions!$C$11:$C$40,\"Government\")","v":0}]
[null,null,null,null,null,null,null,"Customer contributions*",null,{"$f":"SUMIFS(Contributions!$G$11:$G$40,Contributions!$F$11:$F$40,\"Will offset prices\",Contributions!$E$11:$E$40,\"Capital\",Contributions!$C$11:$C$40,\"Customer\")","v":0}]
[null,null,null,null,null,null,null,"Total Capital contributions",null,{"$f":"SUM(J16:J17)","v":0}]
[]
[null,null,null,null,null,null,null,"*New Customer contributions",null,{"$f":"Revenue!$F$18","v":0}]
{"$rows_left_out":8}
{"sheet":"ProfitAndLoss","index":2,"n_rows":90,"n_cols":7,"rows_kept":90,"cut":false,"hidden":false,"merged":[[7,5,9,5]]}
[{"$f":"+'Cover and info'!A1","v":"Water Regulatory Accounting Template"}]
[{"$f":"'Cover and info'!A2","v":"South East Water"}]
["1. Profit and loss"]
["Contents"]
[]
[]
[]
[null,null,"Overview of Stat Accounts","Overview of Stat Accounts",null,"Relevant notes in Annual Report"]
[null,null,{"$f":"INDEX(LU_Years,[0]!SC_Date)","v":"2022-23"},{"$f":"INDEX(LU_Years,[0]!SC_Date-1)","v":"2021-22"}]
[null,null,"$'000","$'000"]
[]
[null,"REVENUE"]
[null,"Revenue"]
[null,"Investment Income"]
[null,"Net profit from sale of assets",{"$f":"IF(C38>=0,C38,0)","v":0},{"$f":"IF(D38>=0,D38,0)","v":0},null,null,"this line links from row 37 (Net profit/(loss) on disposal), if there is a profit"]
[null,"Contributions"]
[null,"Total Revenue",{"$f":"+SUM(C13:C16)","v":0},{"$f":"SUM(D13:D16)","v":0}]
[]
[null,"EXPENSES"]
[null,"Operating Expenditure - cash only",{"$f":"'Operating Costs'!F24","v":0}]
{"$rows_left_out":71}
{"sheet":"BalanceSheet","index":3,"n_rows":56,"n_cols":6,"rows_kept":56,"cut":false,"hidden":false,"merged":[[7,5,9,5]]}
[{"$f":"+'Cover and info'!A1","v":"Water Regulatory Accounting Template"}]
[{"$f":"'Cover and info'!A2","v":"South East Water"}]
["2. Balance sheet"]
["Contents"]
[]
[]
[]
[null,null,"Overview of Stat Accounts","Overview of Stat Accounts",null,"Relevant notes in Annual Report"]
[null,null,{"$f":"INDEX(LU_Years,[0]!SC_Date)","v":"2022-23"},{"$f":"INDEX(LU_Years,[0]!SC_Date-1)","v":"2021-22"}]
[null,null,"$'000","$'000"]
[]
[null,"CURRENT ASSETS"]
[null,"Cash"]
[null,"Receivables"]
[null,"Other"]
[null,"Total Current Assets",{"$f":"+SUM(C13:C15)","v":0},{"$f":"+SUM(D13:D15)","v":0}]
[]
[null,"NON-CURRENT ASSETS"]
[null,"Property, Plant and Equipment"]
[null,"Deferred Tax assets"]
{"$rows_left_out":37}
{"sheet":"CashFlow","index":4,"n_rows":33,"n_cols":6,"rows_kept":33,"cut":false,"hidden":false,"merged":[[7,5,9,5]]}
[{"$f":"+'Cover and info'!A1","v":"Water Regulatory Accounting Template"}]
[{"$f":"'Cover and info'!A2","v":"South East Water"}]
["3. Cash flow statement"]
["Contents"]
[]
[]
[]
[null,null,"Overview of Stat Accounts","Overview of Stat Accounts",null,"Relevant notes in Annual Report"]
[null,null,{"$f":"INDEX(LU_Years,[0]!SC_Date)","v":"2022-23"},{"$f":"INDEX(LU_Years,[0]!SC_Date-1)","v":"2021-22"}]
[null,null,"$'000","$'000"]
[]
[null,"CASH FLOWS FROM OPERATING ACTIVITIES"]
[null,"Receipts"]
[null,"Payments"]
[null,"Net Operating Cash Flow",{"$f":"+C13-C14","v":0},{"$f":"+D13-D14","v":0}]
[]
[null,"CASH FLOWS FROM INVESTING ACTIVITIES"]
[null,"Receipts"]
[null,"Payments"]
[null,"Net Investing Cash Flow",{"$f":"+C18-C19","v":0},{"$f":"+D18-D19","v":0}]
{"$rows_left_out":14}
{"sheet":"Capex","index":5,"n_rows":49,"n_cols":11,"rows_kept":49,"cut":false,"hidden":false,"merged":[[6,5,8,5],[32,3,32,5],[33,3,33,5],[34,3,34,5],[39,3,39,5],[40,3,40,5],[41,3,41,5],[42,3,42,5],[35,3,35,5],[36,3,36,5],[37,3,37,5],[38,3,38,5],[47,3,47,5],[43,3,43,5],[44,3,44,5],[45,3,45,5],[46,3,46,5]]}
[{"$f":"+'Cover and info'!A1","v":"Water Regulatory Accounting Template"}]
[{"$f":"'Cover and info'!A2","v":"South East Water"}]
["4. Capital expenditure"]
["Contents"]
[]
[]
[null,null,null,null,null,"Relevant notes in Annual Report"]
[null,null,{"$f":"INDEX(LU_Years,[0]!SC_Date)","v":"2022-23"},{"$f":"INDEX(LU_Years,[0]!SC_Date-1)","v":"2021-22"}]
[null,null,"$'000","$'000"]
[]
[null,"Additions as per statutory accounts"]
[null,"Adjustments for non-prescribed services*"]
[null,"Accounting adjustments",{"$f":"C25","v":0},null,null,null,"this line links from total accounting adjustments, below"]
[null,"Prescribed services capital expenditure",{"$f":"+SUM(C11:C13)","v":0},{"$f":"+SUM(D11:D13)","v":0}]
[]
[null,"* adjustments for non-prescribed services should be able to be reconciled to non-prescribed sheet"]
[]
[null,"Summary of accounting adjustments"]
[]
[]
{"$rows_left_out":30}
{"sheet":"CapexBreakdown","index":6,"n_rows":32,"n_cols":10,"rows_kept":32,"cut":false,"hidden":false,"merged":[[5,2,5,4],[31,3,31,5],[31,6,31,8],[33,3,33,5],[34,3,34,5],[32,3,32,5],[32,6,32,8],[45,3,45,5],[33,6,33,8],[34,6,34,8],[35,6,35,8],[36,6,36,8],[37,6,37,8],[40,3,40,5],[41,3,41,5],[42,3,42,5],[43,3,43,5],[44,3,44,5],[35,3,35,5],[36,3,36,5],[37,3,37,5],[38,3,38,5],[39,3,39,5],[54,6,54,8],[47,3,47,5],[48,3,48,5],[49,3,49,5],[50,3,50,5],[51,3,51,5],[46,3,46,5],[53,3,53,5],[49,6,49,8],[50,6,50,8],[51,6,51,8],[52,6,52,8],[53,6,53,8],[47,6,47,8],[48,6,48,8],[38,6,38,8],[41,6,41,8],[42,6,42,8],[43,6,43,8],[44,6,44,8],[40,6,40,8]]}
[{"$f":"+'Cover and info'!A1","v":"Water Regulatory Accounting Template"}]
[{"$f":"'Cover and info'!A2","v":"South East Water"}]
["5. Capital expenditure breakdown"]
["Contents"]
[]
[]
[]
[null,null,"Water","Sewerage & trade waste","Recycled water","Total","Total"]
[null,null,{"$f":"INDEX(LU_Years,[0]!SC_Date)","v":"2022-23"},{"$f":"INDEX(LU_Years,[0]!SC_Date)","v":"2022-23"},{"$f":"INDEX(LU_Years,[0]!SC_Date)","v":"2022-23"},{"$f":"INDEX(LU_Years,[0]!SC_Date)","v":"2022-23"},{"$f":"INDEX(LU_Years,[0]!SC_Date-1)","v":"2021-22"}]
[null,null,"$'000","$'000","$'000","$'000","$'000"]
[null,"COST DRIVERS"]
[null,"Growth",null,null,null,{"$f":"+SUM(C12:E12)","v":0}]
[null,"Renewal of existing infrastructure",null,null,null,{"$f":"+SUM(C13:E13)","v":0}]
[null,"Improvement in service",null,null,null,{"$f":"+SUM(C14:E14)","v":0}]
[null,"Compliance",null,null,null,{"$f":"+SUM(C15:E15)","v":0}]
[null,"Total Additions",{"$f":"+SUM(C12:C15)","v":0},{"$f":"+SUM(D12:D15)","v":0},{"$f":"+SUM(E12:E15)","v":0},{"$f":"+SUM(F12:F15)","v":0},{"$f":"+SUM(G12:G15)","v":0}]
[]
[null,null,{"$f":"+C8","v":"Water"},{"$f":"+D8","v":"Sewerage & trade waste"},{"$f":"+E8","v":"Recycled water"},{"$f":"+F8","v":"Total"},{"$f":"+G8","v":"Total"}]
[null,null,{"$f":"INDEX(LU_Years,[0]!SC_Date)","v":"2022-23"},{"$f":"INDEX(LU_Years,[0]!SC_Date)","v":"2022-23"},{"$f":"INDEX(LU_Years,[0]!SC_Date)","v":"2022-23"},{"$f":"INDEX(LU_Years,[0]!SC_Date)","v":"2022-23"},{"$f":"INDEX(LU_Years,[0]!SC_Date-1)","v":"2021-22"}]
[null,null,"$'000","$'000","$'000","$'000","$'000"]
{"$rows_left_out":13}
{"sheet":"Operating Costs","index":7,"n_rows":42,"n_cols":10,"rows_kept":42,"cut":false,"hidden":false,"merged":[[51,3,51,5],[51,6,51,8],[52,3,52,5],[52,6,52,8],[53,3,53,5],[53,6,53,8],[48,3,48,5],[48,6,48,8],[49,3,49,5],[49,6,49,8],[50,3,50,5],[50,6,50,8],[41,3,41,5],[41,6,41,8],[56,3,56,5],[56,6,56,8],[42,3,42,5],[42,6,42,8],[43,3,43,5],[43,6,43,8],[44,3,44,5],[44,6,44,8],[45,3,45,5],[45,6,45,8],[46,3,46,5],[46,6,46,8],[47,3,47,5],[47,6,47,8]]}
[{"$f":"+'Cover and info'!A1","v":"Water Regulatory Accounting Template"}]
[{"$f":"'Cover and info'!A2","v":"South East Water"}]
["6. Operating costs"]
["Contents"]
[]
[]
[]
[null,null,"Water","Sewerage & trade waste","Recycled water","TOTAL","TOTAL"]
[null,null,{"$f":"INDEX(LU_Years,[0]!SC_Date)","v":"2022-23"},{"$f":"INDEX(LU_Years,[0]!SC_Date)","v":"2022-23"},{"$f":"INDEX(LU_Years,[0]!SC_Date)","v":"2022-23"},{"$f":"INDEX(LU_Years,[0]!SC_Date)","v":"2022-23"},{"$f":"INDEX(LU_Years,[0]!SC_Date-1)","v":"2021-22"}]
[null,null,"$'000","$'000","$'000","$'000","$'000"]
[null,"ACTIVITY AREA"]
[null,"Operations and Maintenance",null,null,null,{"$f":"+SUM(C12:E12)","v":0}]
[null,"Bulk charges",null,null,null,{"$f":"+SUM(C13:E13)","v":0}]
[null,"Treatment",null,null,null,{"$f":"+SUM(C14:E14)","v":0}]
[null,"Customer Service and billing",null,null,null,0]
[null,"GSL Payments",null,null,null,0]
[null,"Licence Fees",{"$f":"C37","v":0},{"$f":"D37","v":0},{"$f":"E37","v":0},0,null,"this line links from Schedule 1, below"]
[null,"Corporate",null,null,null,0]
[null,"Environmental contribution",null,null,null,0]
[null,"Purchase of temporary water entitlements",null,null,null,0]
{"$rows_left_out":23}
{"sheet":"Operating Costs Allocation","index":8,"n_rows":33,"n_cols":14,"rows_kept":33,"cut":false,"hidden":false,"merged":[[42,3,42,5],[47,3,47,5],[43,3,43,5],[44,3,44,5],[45,3,45,5],[46,3,46,5],[37,3,37,5],[38,3,38,5],[39,3,39,5],[40,3,40,5],[41,3,41,5],[32,3,32,5],[33,3,33,5],[34,3,34,5],[35,3,35,5],[36,3,36,5]]}
[{"$f":"+'Cover and info'!A1","v":"Water Regulatory Accounting Template"}]
[{"$f":"'Cover and info'!A2","v":"South East Water"}]
["7. Operating costs allocation"]
["Contents"]
[]
[]
[null,null,"Labour (ordinary)","Plant and materials","Contractors","Electricity","Greenhouse gas offsets","Chemicals","Water conservation","Vehicle fleet running costs","IT","Sub total","Other trial balance accounts","Total as per trial balance"]
[null,null,{"$f":"INDEX(LU_Years,[0]!SC_Date)","v":"2022-23"},{"$f":"INDEX(LU_Years,[0]!SC_Date)","v":"2022-23"},{"$f":"INDEX(LU_Years,[0]!SC_Date)","v":"2022-23"},{"$f":"INDEX(LU_Years,[0]!SC_Date)","v":"2022-23"},{"$f":"INDEX(LU_Years,[0]!SC_Date)","v":"2022-23"},{"$f":"INDEX(LU_Years,[0]!SC_Date)","v":"2022-23"},{"$f":"INDEX(LU_Years,[0]!SC_Date)","v":"2022-23"},{"$f":"INDEX(LU_Years,[0]!SC_Date)","v":"2022-23"},{"$f":"INDEX(LU_Years,[0]!SC_Date)","v":"2022-23"},{"$f":"INDEX(LU_Years,[0]!SC_Date)","v":"2022-23"},{"$f":"INDEX(LU_Years,[0]!SC_Date)","v":"2022-23"},{"$f":"INDEX(LU_Years,[0]!SC_Date)","v":"2022-23"}]
[null,null,"$'000","$'000","$'000","$'000","$'000","$'000","$'000","$'000","$'000","$'000","$'000","$'000"]
[null,"Prescribed operating expenditure"]
[null,"Operations and Maintenance",null,null,null,null,null,null,null,null,null,{"$f":"SUM(C11:K11)","v":0},null,{"$f":"+SUM(L11:M11)","v":0}]
[null,"Bulk charges",null,null,null,null,null,null,null,null,null,{"$f":"SUM(C12:K12)","v":0},null,0]
[null,"Treatment",null,null,null,null,null,null,null,null,null,0,null,0]
[null,"Customer Service and billing",null,null,null,null,null,null,null,null,null,0,null,0]
[null,"GSL Payments",null,null,null,null,null,null,null,null,null,0,null,0]
[null,"Licence Fees",null,null,null,null,null,null,null,null,null,0,null,0]
[null,"Corporate",null,null,null,null,null,null,null,null,null,0,null,0]
[null,"Environmental levy",null,null,null,null,null,null,null,null,null,0,null,0]
[null,"Water Conservation",null,null,null,null,null,null,null,null,null,0,null,0]
[null,"Other operating expenditure",null,null,null,null,null,null,null,null,null,0,null,0]
{"$rows_left_out":14}
{"sheet":"Revenue","index":9,"n_rows":118,"n_cols":9,"rows_kept":118,"cut":false,"hidden":false,"merged":[[7,8,8,8]]}
[{"$f":"+'Cover and info'!A1","v":"Water Regulatory Accounting Template"}]
[{"$f":"'Cover and info'!A2","v":"South East Water"}]
["8. Revenue"]
["Contents"]
[]
[]
[]
[null,null,"Water","Sewerage & trade waste","Recycled water","TOTAL","TOTAL",null,"High level account/ledger codes used for each revenue category"]
[null,null,{"$f":"INDEX(LU_Years,[0]!SC_Date)","v":"2022-23"},{"$f":"INDEX(LU_Years,[0]!SC_Date)","v":"2022-23"},{"$f":"INDEX(LU_Years,[0]!SC_Date)","v":"2022-23"},{"$f":"INDEX(LU_Years,[0]!SC_Date)","v":"2022-23"},{"$f":"INDEX(LU_Years,[0]!SC_Date-1)","v":"2021-22"}]
[null,null,"$'000","$'000","$'000","$'000","$'000"]
[null,"Revenue from determined prices or pricing principles"]
[null,"Residential Services",null,null,null,{"$f":"+SUM(C12:E12)","v":0}]
[null,"Non-residential Services",null,null,null,{"$f":"+SUM(C13:E13)","v":0}]
[null,"Non-scheduled Services - Schedule 4 ",{"$f":"C113","v":0},{"$f":"D113","v":0},{"$f":"E113","v":0},0]
[null,"Trade waste Services",null,null,null,0]
[null,"Core Miscellaneous Services - Schedule 2 ",{"$f":"C65","v":0},{"$f":"D65","v":0},{"$f":"E65","v":0},0]
[null,"Bulk Water and Sewerage Services",null,null,null,0]
[null,"New Customer Contributions",null,null,null,0]
[null,"Total revenue from determined prices or pricing principles",{"$f":"+SUM(C12:C18)","v":0},{"$f":"+SUM(D12:D18)","v":0},{"$f":"+SUM(E12:E18)","v":0},{"$f":"+SUM(F12:F18)","v":0},{"$f":"+SUM(G12:G18)","v":0}]
[]
{"$rows_left_out":99}
{"sheet":"Contributions","index":10,"n_rows":50,"n_cols":13,"rows_kept":50,"cut":false,"hidden":false,"merged":[[7,2,8,2],[7,3,8,3],[7,5,8,5],[7,4,8,4]]}
[{"$f":"+'Cover and info'!A1","v":"Water Regulatory Accounting Template"}]
[{"$f":"'Cover and info'!A2","v":"South East Water"}]
["9. Contributions"]
["Contents"]
[null,null,null,null,null,null,null,null,null,"Government","Capital","Will offset prices","Revenue"]
[null,null,null,null,null,null,null,null,null,"Customer","Operating","Will not offset prices","Equity"]
[null,null,null,null,null,null,null,null,null,null,"Gifted Asset"]
[null,null,"Government or customer contribution","Accounting treatment (eg booked as revenue or equity)","Capital, Operating contribution or Gifted Asset","Will offset prices/Will not offset prices","Contribution amount"]
[null,null,null,null,null,null,"$'000"]
[null,"Reason for contribution",null,null,null,null,null,null,"IMPORTANT: read this note before completing this tab"]
[]
[null,null,null,null,null,null,null,null,"If contributions (customer or/and government, excluding gifted assets) are to be included in the RAB, then the following conditions apply:"]
[]
[null,null,null,null,null,null,null,null,"(1) Capital, Operating contribution or Gifted Asset => this category must be selected as \"Capital\""]
[]
[null,null,null,null,null,null,null,null,"(2) Will offset prices/Will not offset prices => this category must be selected as \"Will offset prices\""]
[]
[null,null,null,null,null,null,null,null,"As a sanity check, refer to the Rollforward tab, to ensure that the closing RAB values accurately reflects the correct RAB position."]
[]
[]
{"$rows_left_out":31}
{"sheet":"Provisions","index":11,"n_rows":47,"n_cols":6,"rows_kept":47,"cut":false,"hidden":false,"merged":[]}
[{"$f":"+'Cover and info'!A1","v":"Water Regulatory Accounting Template"}]
[{"$f":"'Cover and info'!A2","v":"South East Water"}]
["10. Provisions - OPTIONAL WORKSHEET, BUSINESS MAY COMPLETE AT THEIR DISCRETION"]
["Contents"]
[]
[]
[]
[null,null,{"$f":"INDEX(LU_Years,[0]!SC_Date)","v":"2022-23"},{"$f":"INDEX(LU_Years,[0]!SC_Date-1)","v":"2021-22"},{"$f":"INDEX(LU_Years,[0]!SC_Date-2)","v":"2020-21"},{"$f":"INDEX(LU_Years,[0]!SC_Date-3)","v":"2019-20"}]
[null,null,"$'000","$'000","$'000","$'000"]
[]
[1,"CURRENT"]
[{"$f":"+A11+1","v":2},"Employee entitlements - annual leave"]
[null,"Employee entitlements - long service leave"]
[null,"Employee entitlements - other"]
[null,"Insurance"]
[null,"Other"]
[null,"Total Current Provisions",{"$f":"+SUM(C12:C16)","v":0},{"$f":"+SUM(D12:D16)","v":0},{"$f":"+SUM(E12:E16)","v":0},{"$f":"+SUM(F12:F16)","v":0}]
[]
[null,"NON-CURRENT"]
[null,"Employee entitlements - annual leave"]
{"$rows_left_out":28}
{"sheet":"ThirdParty","index":12,"n_rows":23,"n_cols":6,"rows_kept":23,"cut":false,"hidden":false,"merged":[]}
[{"$f":"+'Cover and info'!A1","v":"Water Regulatory Accounting Template"}]
[{"$f":"'Cover and info'!A2","v":"South East Water"}]
["11. Third party transactions (remains confidential) - OPTIONAL WORKSHEET, BUSINESS MAY COMPLETE AT THEIR DISCRETION"]
["Contents"]
[]
[]
[]
[null,"Name of Third Party Entity","Service provided","Value      $'000","Description of how the consideration was determined","Description of how this consideration is reflected in the regulatory accounts"]
[]
[]
[]
[]
[]
[]
[]
[]
[]
[]
[]
[]
{"$rows_left_out":4}
{"sheet":"RelatedParty","index":13,"n_rows":23,"n_cols":6,"rows_kept":23,"cut":false,"hidden":false,"merged":[]}
[{"$f":"+'Cover and info'!A1","v":"Water Regulatory Accounting Template"}]
[{"$f":"'Cover and info'!A2","v":"South East Water"}]
["12. Related party transactions (remains confidential) - OPTIONAL WORKSHEET, BUSINESS MAY COMPLETE AT THEIR DISCRETION"]
["Contents"]
[]
[]
[]
[null,"Name of Related Party","Service provided","Value     $'000","Description of how the consideration was determined","Description of how this consideration is reflected in the regulatory accounts"]
[]
[]
[]
[]
[]
[]
[]
[]
[]
[]
[]
[]
{"$rows_left_out":4}
{"sheet":"UnbundledSegments","index":14,"n_rows":24,"n_cols":10,"rows_kept":24,"cut":false,"hidden":false,"merged":[[38,3,38,5],[38,6,38,8],[31,3,31,5],[31,6,31,8],[32,3,32,5],[32,6,32,8],[33,3,33,5],[33,6,33,8],[34,3,34,5],[34,6,34,8],[35,3,35,5],[35,6,35,8],[36,3,36,5],[36,6,36,8],[37,3,37,5],[37,6,37,8],[30,3,30,5],[30,6,30,8],[23,3,23,5],[23,6,23,8],[24,3,24,5],[24,6,24,8],[25,3,25,5],[25,6,25,8],[26,3,26,5],[26,6,26,8],[27,3,27,5],[27,6,27,8],[28,3,28,5],[28,6,28,8],[29,3,29,5],[29,6,29,8]]}
[{"$f":"+'Cover and info'!A1","v":"Water Regulatory Accounting Template"}]
[{"$f":"'Cover and info'!A2","v":"South East Water"}]
["13. Unbundled segments - OPTIONAL WORKSHEET, BUSINESS MAY COMPLETE AT THEIR DISCRETION"]
["Contents"]
[]
[]
[]
[null,null,"Water - Collection and Storage","Water - Treatment","Water - Transport","Sewage - Treatment","Sewage - Transport","Recycled water","TOTAL"]
[null,null,"$'000","$'000","$'000","$'000","$'000","$'000","$'000","Check with other templates"]
[]
[null,"Revenue (excl. revenue from disposals)",null,null,null,null,null,null,{"$f":"+SUM(C11:H11)","v":0},{"$f":"Revenue!F37-Revenue!F33-Revenue!F24","v":0}]
[null,"Additions",null,null,null,null,null,null,0,{"$f":"Capex!C14","v":0}]
[null,"Operating Expenditure",null,null,null,null,null,null,0,{"$f":"'Operating Costs'!F24","v":0}]
[null,"New Customer Contributions",null,null,null,null,null,null,0,{"$f":"Revenue!F18","v":0}]
[null,"Government Contributions",null,null,null,null,null,null,0,{"$f":"Revenue!F25+Revenue!F26","v":0}]
[null,"Gifted Assets",null,null,null,null,null,null,0,{"$f":"Revenue!F27","v":0}]
[null,"Proceeds from Asset disposal (to be deducted from RAB)",null,null,null,null,null,null,0,{"$f":"Revenue!F24","v":0}]
[]
[]
[]
{"$rows_left_out":5}
{"sheet":"Non-prescribed","index":15,"n_rows":57,"n_cols":8,"rows_kept":57,"cut":false,"hidden":false,"merged":[[70,4,70,6],[71,4,71,6],[68,4,68,6],[69,4,69,6],[62,4,62,6],[63,4,63,6],[60,4,60,6],[61,4,61,6],[66,4,66,6],[67,4,67,6],[64,4,64,6],[65,4,65,6],[58,4,58,6],[59,4,59,6],[7,6,9,6],[56,4,56,6],[57,4,57,6],[54,1,54,6]]}
[{"$f":"+'Cover and info'!A1","v":"Water Regulatory Accounting Template"}]
[{"$f":"'Cover and info'!A2","v":"South East Water"}]
["14. Non-prescribed services (remains confidential)"]
["Contents"]
[]
[]
[]
[null,"Service Name","Description","Revenue","Operating expenditure","Capital expenditure","High level account/ledger codes used for each non-prescribed service"]
[null,null,null,{"$f":"INDEX(LU_Years,[0]!SC_Date)","v":"2022-23"},{"$f":"INDEX(LU_Years,[0]!SC_Date)","v":"2022-23"},{"$f":"INDEX(LU_Years,[0]!SC_Date)","v":"2022-23"}]
[null,null,null,"$'000","$'000","$'000"]
[]
[]
[]
[]
[]
[]
[]
[]
[]
[]
{"$rows_left_out":38}
{"sheet":"RollForward","index":16,"n_rows":31,"n_cols":28,"rows_kept":31,"cut":false,"hidden":false,"merged":[]}
[{"$f":"+'Cover and info'!A1","v":"Water Regulatory Accounting Template"}]
[{"$f":"'Cover and info'!A2","v":"South East Water"}]
["15. Rolled-forward RAB - SHEET IS FORMULA DRIVEN"]
["Contents"]
[]
[]
[null,{"$f":"CONCATENATE(\"Figures expressed in $'000, \",LEFT(ProfitAndLoss!C9,2),RIGHT(ProfitAndLoss!C9,2),\" dollars\")","v":"Figures expressed in $'000, 2023 dollars"}]
[null,null,null,null,null,null,"2004-05","2005-06","2006-07","2007-08","2008-09","2009-10","2010-11","2011-12","2012-13","2013-14","2014-15","2015-16","2016-17","2017-18","2018-19","2019-20","2020-21","2021-22","2022-23",null,"Legend:"]
[null,null,null,null,null,null,null,null,null,null,null,null,null,null,null,null,null,null,null,null,null,null,null,null,null,null,null,"sourced from 2013 final decision model and inflated"]
[null,"Opening Asset Value",null,null,null,null,null,null,null,null,null,null,null,null,null,null,null,null,null,null,null,null,null,null,{"$f":"X15","v":""},null,null,"sourced from 2018 final decision model and inflated"]
[null,"plus Capital Expenditure",null,null,null,null,null,null,null,null,null,null,null,null,null,null,null,null,null,null,null,null,null,null,{"$f":"IFERROR(Capex!$C$14/Y23,\"\")","v":0},null,null,"sourced from 2023 final decision model and inflated"]
[null,"less Capital Contributions",null,null,null,null,null,null,null,null,null,null,null,null,null,null,null,null,null,null,null,null,null,null,{"$f":"IFERROR(-(SUMPRODUCT((Contributions!$E$11:$E$40=\"Capital\")*(Contributions!$F$11:$F$40=\"Will offset prices\")*(Contributions!$G$11:$G$40)))/Y23,\"\")","v":0},null,null,"actuals from current period"]
[null,"less Depreciation (forecast)"]
[null,"less Disposals",null,null,null,null,null,null,null,null,null,null,null,null,null,null,null,null,null,null,null,null,null,null,{"$f":"IFERROR(-Revenue!$F$24/Y23,\"\")","v":0}]
[null,"Closing Asset Value",null,null,null,null,{"$f":"IF(SUM(G10:G14)=0,\"\",SUM(G10:G14))","v":""},"","","","","","","","",{"$f":"IF(SUM(P10:P14)=0,\"\",SUM(P10:P14))","v":""},"","","","","",{"$f":"IF(SUM(V10:V14)=0,\"\",SUM(V10:V14))","v":""},{"$f":"IF(SUM(W10:W14)=0,\"\",SUM(W10:W14))","v":""},{"$f":"IF(SUM(X10:X14)=0,\"\",SUM(X10:X14))","v":""},{"$f":"IF(SUM(Y10:Y14)=0,\"\",SUM(Y10:Y14))","v":""}]
[]
[]
[]
[null,"Inflation inputs"]
[null,null,null,null,null,"2003-04",{"$f":"G8","v":"2004-05"},"2005-06","2006-07","2007-08","2008-09","2009-10","2010-11","2011-12","2012-13","2013-14","2014-15","2015-16","2016-17","2017-18",{"$f":"U8","v":"2018-19"},{"$f":"V8","v":"2019-20"},{"$f":"W8","v":"2020-21"},{"$f":"X8","v":"2021-22"},{"$f":"Y8","v":"2022-23"}]
{"$rows_left_out":12}
{"sheet":"Lookups","index":17,"n_rows":49,"n_cols":19,"rows_kept":49,"cut":false,"hidden":true,"merged":[[27,4,27,17]]}
[{"$f":"+'Cover and info'!A1","v":"Water Regulatory Accounting Template"}]
["Lookup tables"]
[]
[]
[]
[]
[null,"[Year]"]
[null,"2012-13"]
[null,{"$f":"LEFT(B8,4)+1&\"-\"&RIGHT(B8,2)+1","v":"2013-14"}]
[null,{"$f":"LEFT(B9,4)+1&\"-\"&RIGHT(B9,2)+1","v":"2014-15"}]
[null,"2015-16"]
[null,"2016-17"]
[null,"2017-18"]
[null,"2018-19"]
[null,"2019-20"]
[null,"2020-21"]
[null,"2021-22"]
[null,"2022-23"]
[null,"2023-24"]
[null,"2024-25"]
{"$rows_left_out":29}